{"text_format":"1","workbook":"xlsx","n_sheets":6,"sheets":["U026","Catálogo_PP´s","ODS","sub_eje","CF","Ejes y subejes_"],"not_rendered":{"charts":0,"images":6,"macros":1,"external_links":1,"defined_names":12,"comments":0,"pivot_tables":0},"unopened":[],"bounds":{"document_bytes":16777216,"sheet_cells":100000,"rows_first":2000,"rows_last":500,"rows_between":2000,"halvings":0,"cell_chars":16384,"cell_head_chars":4096},"cells_cut":0,"cells_raw":0,"read":"whole","date_system":"1900"}

{"sheet":"U026","index":0,"n_rows":122,"n_cols":16,"rows_kept":122,"cut":false,"hidden":false,"merged":[[121,2,121,7],[121,11,122,15],[122,2,122,7],[114,1,115,8],[114,10,114,16],[115,10,115,16],[117,2,117,7],[117,11,117,15],[120,2,120,7],[120,11,120,15],[110,1,110,8],[110,9,110,16],[111,1,112,8],[111,10,111,16],[112,10,112,16],[113,1,113,8],[113,9,113,16],[105,1,106,8],[105,10,105,16],[106,10,106,16],[107,1,107,8],[107,9,107,16],[108,1,109,8],[108,10,108,16],[109,10,109,16],[101,1,101,8],[101,9,101,16],[102,1,103,8],[102,10,102,16],[103,10,103,16],[104,1,104,8],[104,9,104,16],[96,1,97,8],[96,10,96,16],[97,10,97,16],[98,1,98,8],[98,9,98,16],[99,1,100,8],[99,10,99,16],[100,10,100,16],[92,1,92,8],[92,9,92,16],[93,1,94,8],[93,10,93,16],[94,10,94,16],[95,1,95,8],[95,9,95,16],[87,1,88,8],[87,10,87,16],[88,10,88,16],[89,1,89,8],[89,9,89,16],[90,1,91,8],[90,10,90,16],[91,10,91,16],[83,1,83,8],[83,9,83,16],[84,1,85,8],[84,10,84,16],[85,10,85,16],[86,1,86,8],[86,9,86,16],[78,1,79,8],[78,10,78,16],[79,10,79,16],[80,1,80,8],[80,9,80,16],[81,1,82,8],[81,10,81,16],[82,10,82,16],[74,1,74,8],[74,9,74,16],[75,1,76,8],[75,10,75,16],[76,10,76,16],[77,1,77,8],[77,9,77,16],[69,1,70,8],[69,10,69,16],[70,10,70,16],[71,1,71,8],[71,9,71,16],[72,1,73,8],[72,10,72,16],[73,10,73,16],[65,1,65,8],[65,9,65,16],[66,1,67,8],[66,10,66,16],[67,10,67,16],[68,1,68,8],[68,9,68,16],[60,1,61,8],[60,10,60,16],[61,10,61,16],[62,1,62,8],[62,9,62,16],[63,1,64,8],[63,10,63,16],[64,10,64,16],[56,1,56,8],[56,9,56,16],[57,1,58,8],[57,10,57,16],[58,10,58,16],[59,1,59,8],[59,9,59,16],[51,1,52,8],[51,10,51,16],[52,10,52,16],[53,1,53,8],[53,9,53,16],[54,1,55,8],[54,10,54,16],[55,10,55,16],[47,1,47,8],[47,9,47,16],[48,1,49,8],[48,10,48,16],[49,10,49,16],[50,1,50,8],[50,9,50,16],[39,1,40,8],[39,10,39,16],[40,10,40,16],[41,1,41,8],[41,9,41,16],[42,1,43,8],[42,10,42,16],[43,10,43,16],[44,1,44,8],[44,9,44,16],[45,1,46,8],[45,10,45,16],[46,10,46,16],[36,1,36,8],[36,9,36,16],[37,1,37,8],[37,10,37,16],[38,1,38,8],[38,9,38,16],[34,1,34,4],[34,5,34,8],[34,9,34,12],[34,13,34,16],[35,1,35,8],[35,9,35,16],[32,2,32,6],[32,7,32,10],[32,12,32,16],[33,1,33,4],[33,5,33,8],[33,9,33,12],[33,13,33,16],[27,1,27,3],[27,4,27,16],[29,1,29,16],[30,1,31,1],[30,2,31,6],[30,7,31,10],[30,11,31,11],[30,12,31,16],[23,1,23,16],[24,1,24,3],[24,4,24,16],[25,1,25,3],[25,4,25,16],[26,1,26,3],[26,4,26,16],[19,14,20,16],[20,6,20,11],[21,3,21,4],[21,7,21,8],[21,11,21,12],[21,15,21,16],[16,1,16,3],[16,4,16,5],[16,6,16,16],[17,1,17,3],[17,4,17,16],[18,1,20,3],[18,6,18,11],[18,12,20,13],[18,14,18,16],[19,6,19,11],[9,1,9,16],[10,2,10,16],[11,2,11,16],[12,2,12,16],[13,2,13,16],[15,1,15,16],[1,1,1,16],[2,1,2,16],[4,1,4,16],[6,1,6,16],[7,1,7,3],[7,4,7,5],[7,6,7,16]]}
[]
[null,"SECRETARÍA DE ADMINISTRACIÓN Y FINANZAS"]
[null,"SUBSECRETARÍA DE EGRESOS"]
[]
[]
[]
[]
[null,"Unidad Responsable",null,null,"02CD14",null,{"$f":"IFERROR(VLOOKUP(E8,CF!V3:W114,2,0),\"Centro Gestor\")","v":"ALCALDÍA TLALPAN"}]
[]
[null,"Planeación Estratégica Marco"]
[null,"Misión ","Ser un gobierno transparente y honesto con responsabilidad y rendición de cuentas, incluyente desde la diversidad en la construcción y rescate de nuestra identidad, con una participación ciudadana en las acciones y programas de gobierno, cercano a la gente y efectivo en la atención de los servicios urbanos y necesidades de  la comunidad, con efectividad y eficiencia en sus acciones y programas, con inclusión, equidad y bienestar; sustentable en nuestro entorno y cuidado de la riqueza de los recursos naturales de la Alcaldía Tlalpan."]
[null,"Diagnóstico General","La Alcaldía de Tlalpan es la demarcación más extensa de la Ciudad de México, su territorio es de 312 km2, de los cuales el 84 % es considerado suelo de conservación. De acuerdo con el Instituto Nacional de Estadística y Geografía (INEGI, 2015) en ella habitan 677,104 personas, de las cuales 355,979 son mujeres (53 %) y 321,125 son hombres (47 %); el 21 % de la población total tiene entre 0 y 14 años, 70 % tiene entre 15 y 64 años y 9 % tiene 65 y más. \nEl 1.9 % de la población de 5 años y más habla alguna lengua indígena; 25,862 personas tienen algún tipo de discapacidad (lo que representa el 6 %); del total de los habitantes de la demarcación, el 24 % no está afiliada a ninguna insitución pública de salud y el 10.5 % tiene al menos una carencia alimentaria (INEGI, 2015).\nEn Tlalpan existen 190,591 viviendas, de las cuales el 81.34 % son casas, mientras que el 15.44 % son departamentos en edificio. Sigue habiendo carencias en cuanto a la estructura de las viviendas; de cada 100 viviendas una tiene piso de tierra y 9 de cada 100 tiene techo de lámina, cartón, palma, madera o paja, acentuándose esto en las zonas de los pueblos de la demarcación. \nEn Tlalpan habitan 90,231 niñas y niños de 6 a 14 años, de los cuales el 5.75 % no saben leer y escribir, lo cual es un indicativo del rezago educativo. \nEn 2016 el Consejo de Evaluación del Desarrollo Social de la Ciudad de México (EVALÚA) dio a conocer el último Índice de Desarrollo Social (IDS) de la Ciudad de México, lo que ubicó a Tlalpan como una demarcación con bajo IDS, sólo por encima de Xochimilco, Tláhuac y Milpa Alta, teniendo los índices más bajos en los rubros de calidad de espacio de la vivienda, acceso a la salud, seguridad social y adecuación sanitaria. \nLa población económicamente activa de Tlalpan es de 307,257 personas, de las cuales el 37.91 % se dedica al comercio y a servicios, 44.49 % son profesionistas, 0.72 % se dedican a las actividades agropecuarias y 15.09 % son trabajadores artesanales, conductores de transporte y operadores de maquinaria industrial.                                                                                                                                                                                                                                                                                                                                   \nDe acuerdo con el \"Informe de pobreza y evaluación 2020. Ciudad de México\" realizado por el  Consejo Nacional de Evaluación de la Política de Desarrollo Social (Coneval), Tlalpan en 2015 contaba con 217,122 personas en sitación de pobreza, es decir, 30,487 más respecto a 2010. En materia de pobreza extrema, en 2015 Tlalpan se ubicó dentro de las cinco demarcaciones de la Ciudad de Mèxico con mayor número de personas en esta situación, sólo por debajo de Iztapalapa y Gustavo A. Madero.\nTlalpan es una de las siete demarcaciones con área rural, en su territorio se encuentran 9 áreas naturales protegidas por el Gobierno de la Ciudad de México: Parque Nacional Fuentes Brotantes, Los Encinos, Cumbres del Ajusco, Chichinautzin, Ecoguardas, Bosque de Tlalpan, Parque Ecológico de la Ciudad de México, Reserva Ecológica Comunitaria San Miguel Topilejo y Reserva Ecológica Comunitaria San Miguel Ajusco. Este territorio es rico en recursos naturales, los cuales son vitales para la subsistencia y viabilidad de la Ciudad de México, sin embargo la sobre explotación de los acuíferos profundos y la deforestación ha ocasionado desequilibrios ecológicos. \nDe acuerdo con las cifras dadas a conocer por la Secretaría de Seguridad Ciudadana de la Ciudad de México (SSC), Tlalpan se ubica en la séptima posición de índice delictivo del total de alcaldías. En el último año se registró una disminución de más del 14 % respecto a los delitos de alto impacto, es importante destacar que el 50 % de los delitos se concentra en el robo de vehículos.  \n"]
[null,"Visión ","Garantizar los derechos de la ciudadanía y disminuir progresivamente la pobreza, la desigualdad y promover el desarrollo sustentable, así como la preservación del patrimonio cultural tangible e intangible, la identidad y la   representación democrática de los pueblos y barrios originarios, comunidades y colonias asentadas en la demarcación territorial de Tlalpan. "]
[null,"Objetivo Estratégico","Construir una demarcación incluyente, sostenible y sustentable, con un enfoque de igualdad de derechos para atender de manera oportuna, eficiente y eficaz las necesidades que demanda la población, aplicando procesos de mejora continua que contribuyan a elevar la calidad de vida de la ciudadanía. "]
[]
[null,"Programa Presupuestario y su Alineación"]
[null,"Programa Presupuestario",null,null,"U026",null,{"$f":"IFERROR(VLOOKUP(E17,Catálogo_PP´s!B3:C338,2,0),\"Programa\")","v":"APOYOS ECONÓMICOS Y OTRAS AYUDAS SOCIALES"}]
[null,"Objetivo",null,null,"Contribuir a que la población de la Alcaldía Tlalpan, principalmente la de un alto grado de marginalidad, cuente con la atención oportuna a sus necesidades por medio de acciones y de apoyos sociales. "]
[null,"Alineación al Programa de Gobierno 2019- 2024",null,null,"EJE",1,{"$f":"IFERROR(VLOOKUP(F19,'Ejes y subejes_'!A2:D156,4,0),\"Alineación Inexistente\")","v":"Igualdad y Derechos"},null,null,null,null,null,"Alineación al Objetivo del Desarrollo Sostenible",null,10]
[null,null,null,null,"SUB EJE",6,{"$f":"IFERROR(VLOOKUP(VALUE(F19&F20),'Ejes y subejes_'!B3:D139,3,0),\"Alineación Inexistente\")","v":"Derecho a la igualdad e inclusión"},null,null,null,null,null,null,null,{"$f":"IFERROR(VLOOKUP(O19,ODS!A3:B19,2,0),\"Alineación Inexistente\")","v":"Reducción de las desigualdades "}]
{"$rows_left_out":103}
{"sheet":"Catálogo_PP´s","index":1,"n_rows":338,"n_cols":3,"rows_kept":338,"cut":false,"hidden":true,"merged":[]}
[]
[null,"Programa \nPresupuestario","Denominación"]
[null,"0000","TRANSFERENCIAS A ÓRGANOS AUTÓNOMOS"]
[null,"B001","PRODUCCIÓN Y COMERCIALIZACIÓN DE MEZCLAS ASFÁLTICAS"]
[null,"D001","SERVICIO DE LA DEUDA"]
[null,"D002","DEVOLUCIÓN DE INGRESOS PERCIBIDOS INDEBIDAMENTE"]
[null,"E001","ACCESO A LA JUSTICIA PARA LAS MUJERES Y NIÑAS VÍCTIMAS DE VIOLENCIA Y DISCRIMINACIÓN DE GÉNERO"]
[null,"E002","ACCIONES DE FORTALECIMIENTO PARA LA PROCURACIÓN DE JUSTICIA"]
[null,"E003","ACCIONES DE OBRAS Y SERVICIOS PARA LA RECUPERACIÓN, PROMOCIÓN Y PROTECCIÓN DEL CENTRO HISTÓRICO"]
[null,"E004","PREVENCIÓN DE CÁNCER DE MAMA Y CERVICOUTERINO"]
[null,"E005","ACCIONES PARA MEJORAR LA GOBERNANZA DIGITAL"]
[null,"E006","ACCIONES PARA PROYECTOS AMBIENTALES"]
[null,"E007","PREVENCIÓN DEL DELITO"]
[null,"E011","FORTALECIMIENTO EN MATERIA JURÍDICA"]
[null,"E012","ATENCIÓN MEDICA"]
[null,"E014","ATENCIÓN A PERSONAS ADULTAS PRIVADAS DE SU LIBERTAD Y EN PROCEDIMIENTO LEGAL"]
[null,"E016","ATENCIÓN INTEGRAL Y TRATAMIENTO DE ADICCIONES"]
[null,"E017","ATENCIÓN MÉDICA A PERSONAS PRIVADAS DE SU LIBERTAD Y EN PROCEDIMIENTO LEGAL"]
[null,"E018","ATENCIÓN VETERINARIA"]
[null,"E019"," PREVENCIÓN Y ATENCIÓN  DE LA VIOLENCIA CONTRA LAS MUJERES"]
{"$rows_left_out":319}
{"sheet":"ODS","index":2,"n_rows":28,"n_cols":5,"rows_kept":28,"cut":false,"hidden":true,"merged":[]}
["ODS_AGENDA_2030              DEN_ODS","Denominación",null,null,"Acciones"]
[]
[1,"Fin de la pobreza",null,null,"Acciones"]
[2,"Hambre cero ",null,null,"1 Acción"]
[3,"Salud y bienestar ",null,null,"2 Acciones"]
[4,"Educación de calidad",null,null,"3 Acciones"]
[5,"Igualdad de género ",null,null,"4 Acciones"]
[6,"Agua limpia y saneamiento ",null,null,"5 Acciones"]
[7,"Energía asequible y no contaminante",null,null,"6 Acciones"]
[8,"Trabajo decente y crecimiento económico ",null,null,"7 Acciones"]
[9,"Industria, innovación e infraestructuras",null,null,"8 Acciones"]
[10,"Reducción de las desigualdades ",null,null,"9 Acciones"]
[11,"Ciudades y comunidades sostenibles",null,null,"10 Acciones"]
[12,"Producción y consumo responsables",null,null,"11 Acciones"]
[13,"Acción por el clima",null,null,"12 Acciones"]
[14,"Vida submarina",null,null,"13 Acciones"]
[15,"Vida de ecosistemas terrestres",null,null,"14 Acciones"]
[16,"Paz, justicia e instituciones sólidas",null,null,"15 Acciones"]
[17,"Alianzas para lograr los objetivos",null,null,"16 Acciones"]
[null,null,null,null,"17 Acciones"]
{"$rows_left_out":9}
{"sheet":"sub_eje","index":3,"n_rows":92,"n_cols":9,"rows_kept":92,"cut":false,"hidden":true,"merged":[]}
["EJE","DENOMINACIÓN","X","SUB EJE","DENOMINACIÓN","X","SUB \nSUB EJE","DENOMINACIÓN","X"]
[1,"Igualdad y Derechos",{"$f":"CONCATENATE(A2,\"- \",B2)","v":"1- Igualdad y Derechos"},"1","Cultura Comunitaria",{"$f":"CONCATENATE(D2,\"- \",E2)","v":"1- Cultura Comunitaria"},"0","Atención Ciudadana",{"$f":"CONCATENATE(G2,\"- \",H2)","v":"0- Atención Ciudadana"}]
[2,"Ciudad Sustentable",{"$f":"CONCATENATE(A3,\"- \",B3)","v":"2- Ciudad Sustentable"},"1","Derecho a la educación",{"$f":"CONCATENATE(D3,\"- \",E3)","v":"1- Derecho a la educación"},"0","Cultura Comunitaria",{"$f":"CONCATENATE(G3,\"- \",H3)","v":"0- Cultura Comunitaria"}]
[3,"Más y Mejor Movilidad","3- Más y Mejor Movilidad","1","Desarrollo económico sustentable e incluyente y generación de empleo","1- Desarrollo económico sustentable e incluyente y generación de empleo","0","Derecho a la educación","0- Derecho a la educación"]
[4,"Ciudad de México, capital cultural de America Latina","4- Ciudad de México, capital cultural de America Latina","1","Integrar","1- Integrar","0","Derecho a la igualdad e inclusión","0- Derecho a la igualdad e inclusión"]
[5,"Cero Agresión y Más Seguridad","5- Cero Agresión y Más Seguridad","1","Seguridad Ciudadana","1- Seguridad Ciudadana","0","Derecho a la salud","0- Derecho a la salud"]
[6,"Ciencia, Innovación y Transparencia","6- Ciencia, Innovación y Transparencia","1","Tecnología","1- Tecnología","0","Derechos de las mujeres","0- Derechos de las mujeres"]
[null,null,"- ","2","Ciencia y divulgación","2- Ciencia y divulgación","0","Festivales y Fiestas","0- Festivales y Fiestas"]
[null,null,null,"2","Derecho a la salud","2- Derecho a la salud","0","Fortalecimiento de la procuración de justicia","0- Fortalecimiento de la procuración de justicia"]
[null,null,null,"2","Desarrollo urbano sustentable e incluyente","2- Desarrollo urbano sustentable e incluyente","0","Gobierno Abierto","0- Gobierno Abierto"]
[null,null,null,"2","Fortalecimiento de la procuración de justicia","2- Fortalecimiento de la procuración de justicia","0","Integrar","0- Integrar"]
[null,null,null,"2","Mejorar","2- Mejorar","0","Medio ambiente y recursos naturales","0- Medio ambiente y recursos naturales"]
[null,null,null,"2","Memoria y Patrimonio Cultural comunitario","2- Memoria y Patrimonio Cultural comunitario","0","Memoria y Patrimonio Cultural comunitario","0- Memoria y Patrimonio Cultural comunitario"]
[null,null,null,"3","Derecho a la cultura física y la práctica del deporte","3- Derecho a la cultura física y la práctica del deporte","0","Promoción y Difusión de los Derechos Culturales","0- Promoción y Difusión de los Derechos Culturales"]
[null,null,null,"3","Educación y Formación Artística y Cultural","3- Educación y Formación Artística y Cultural","0","Protección civil","0- Protección civil"]
[null,null,null,"3","Gobierno Abierto","3- Gobierno Abierto","0","Pueblos originarios y poblaciones indígenas residentes","0- Pueblos originarios y poblaciones indígenas residentes"]
[null,null,null,"3","Medio ambiente y recursos naturales","3- Medio ambiente y recursos naturales","0","Seguridad ciudadana","0- Seguridad ciudadana"]
[null,null,null,"3","Protección civil","3- Protección civil","0","Vinculación Interinstitucional y cooperación cultural","0- Vinculación Interinstitucional y cooperación cultural"]
[null,null,null,"3","Proteger","3- Proteger","1","Alerta inmediata","1- Alerta inmediata"]
[null,null,null,"4","Atención Ciudadana","4- Atención Ciudadana","1","Ampliar y fortalecer la educación inicial","1- Ampliar y fortalecer la educación inicial"]
{"$rows_left_out":73}
{"sheet":"CF","index":4,"n_rows":191,"n_cols":23,"rows_kept":191,"cut":false,"hidden":true,"merged":[]}
["NIVEL","CONCATENADO","FINALIDAD","FUNCIÓN","SUBFUNCIÓN","DENOMINACIÓN","DENOM - Altas Bajas",null,null,null,null,null,null,null,null,"AI","DENOMINACIÓN",null,null,null,null,"CG","DENOMINACIÓN"]
[{"$f":"+LEN(B2)","v":1},{"$f":"CONCATENATE(C2,D2,E2)","v":"1"},1,null,null,"GOBIERNO","GOBIERNO"]
[{"$f":"+LEN(B3)","v":2},{"$f":"CONCATENATE(C3,D3,E3)","v":"11"},1,1,null,"LEGISLACIÓN","Legislación",null,null,1,"Gobierno",null,null,null,null,"001","FUNCIÓN PÚBLICA Y BUEN GOBIERNO",null,null,null,null,"01C001","JEFATURA DE GOBIERNO"]
[3,"111",1,1,1,"LEGISLACIÓN","Legislación",null,null,2,"Desarrollo Social",null,null,null,null,"002","GESTIÓN INTEGRAL DE RIESGOS EN MATERIA DE PROTECCIÓN CIVIL",null,null,null,null,"01CD03","CENTRO DE COMANDO, CONTROL, CÓMPUTO, COMUNICACIONES Y CONTACTO CIUDADANO"]
[3,"112",1,1,2,"FISCALIZACIÓN","Fiscalización",null,null,3,"Desarrollo Económico",null,null,null,null,"003","TRANSVERSALIZACIÓN DE LA PERSPECTIVA DE GÉNERO",null,null,null,null,"01CD06","AGENCIA DIGITAL DE INNOVACION PUBLICA DE LA CDMX"]
[2,"12",1,2,null,"JUSTICIA","Justicia",null,null,4,"Otras No Clasificadas En Funciones Anteriores",null,null,null,null,"004","TRANSVERSALIZACIÓN DEL ENFOQUE DE DERECHOS HUMANOS",null,null,null,null,"01P0ES","FONDO PARA EL DESARROLLO ECONÓMICO Y SOCIAL"]
[3,"121",1,2,1,"IMPARTICIÓN DE JUSTICIA","Impartición De Justicia",null,null,null,null,null,null,null,null,"005","SEGURO CONTRA ACCIDENTES PERSONALES DE ESCOLARES",null,null,null,null,"02C001","SECRETARÍA DE GOBIERNO"]
[3,"122",1,2,2,"PROCURACIÓN DE JUSTICIA","Procuración De Justicia",null,null,null,null,null,null,null,null,"006","SISTEMA DE PROTECCIÓN INTEGRAL DE NIÑAS, NIÑOS Y ADOLESCENTES DE LA CIUDAD DE MÉXICO",null,null,null,null,"02CD01","ALCALDÍA ÁLVARO OBREGÓN"]
[3,"123",1,2,3,"RECLUSIÓN Y READAPTACIÓN SOCIAL","Reclusión Y Readaptación Social",null,null,{"$f":"+J8+1","v":1},null,null,null,null,null,"007","ACCIONES DE RECONSTRUCCIÓN Y OTRAS PREVISIONES",null,null,null,null,"02CD02","ALCALDÍA AZCAPOTZALCO"]
[3,"124",1,2,4,"DERECHOS HUMANOS","Derechos Humanos",null,null,{"$f":"+J9+1","v":2},null,null,null,null,null,"008","ACCIONES DIRIGIDAS A PERSONAS CON DISCAPACIDAD",null,null,null,null,"02CD03","ALCALDÍA BENITO JUÁREZ"]
[2,"13",1,3,null,"COORDINACIÓN DE LA POLÍTICA DE GOBIERNO","Coordinación De La Política De Gobierno",null,null,3,null,null,null,null,null,"009","ACCIONES DIRIGIDAS A PERSONAS PRIVADAS DE SU LIBERTAD Y EN PROCEDIMIENTO LEGAL",null,null,null,null,"02CD04","ALCALDÍA COYOACÁN"]
[3,"131",1,3,1,"PRESIDENCIA / GUBERNATURA","Presidencia / Gubernatura",null,null,4,null,null,null,null,null,"010","ACCIONES EN MATERIA DE PREVENCIÓN Y ATENCIÓN DE ADICCIONES",null,null,null,null,"02CD05","ALCALDÍA CUAJIMALPA DE MORELOS"]
[3,"132",1,3,2,"POLÍTICA INTERIOR","Política Interior",null,null,5,null,null,null,null,null,"011","POLÍTICA FISCAL Y TRIBUTARIA",null,null,null,null,"02CD06","ALCALDÍA CUAUHTÉMOC"]
[3,"133",1,3,3,"PRESERVACIÓN Y CUIDADO DEL PATRIMONIO PÚBLICO","Preservación Y Cuidado Del Patrimonio Público",null,null,6,null,null,null,null,null,"013","PREVENCIÓN DE LA VIOLENCIA CON PARTICIPACIÓN CIUDADANA",null,null,null,null,"02CD07","ALCALDÍA GUSTAVO A. MADERO"]
[3,"134",1,3,4,"FUNCIÓN PÚBLICA","Función Pública",null,null,7,null,null,null,null,null,"014","APOYO A LA PROCURACIÓN DE JUSTICIA",null,null,null,null,"02CD08","ALCALDÍA IZTACALCO"]
[3,"135",1,3,5,"ASUNTOS JURÍDICOS","Asuntos Jurídicos",null,null,8,null,null,null,null,null,"015","ASESORÍA PARA PROGRAMAS Y PROYECTOS",null,null,null,null,"02CD09","ALCALDÍA IZTAPALAPA"]
[3,"136",1,3,6,"ORGANIZACIÓN DE PROCESOS ELECTORALES","Organización De Procesos Electorales",null,null,9,null,null,null,null,null,"017","ATENCIÓN A GRUPOS VULNERABLES",null,null,null,null,"02CD10","ALCALDÍA LA MAGDALENA CONTRERAS"]
[3,"137",1,3,7,"POBLACIÓN","Población",null,null,0,null,null,null,null,null,"019","ATENCIÓN INTEGRAL A VÍCTIMAS DE VIOLENCIA",null,null,null,null,"02CD11","ALCALDÍA MIGUEL HIDALGO"]
[3,"138",1,3,8,"TERRITORIO","Territorio",null,null,null,null,null,null,null,null,"020","ATENCIÓN MÉDICA INTEGRAL",null,null,null,null,"02CD12","ALCALDÍA MILPA ALTA"]
[3,"139",1,3,9,"OTROS","Otros",null,null,null,null,null,null,null,null,"021","CAPACITACIÓN Y FORTALECIMIENTO PARA Y EN EL TRABAJO",null,null,null,null,"02CD13","ALCALDÍA TLÁHUAC"]
{"$rows_left_out":172}
{"sheet":"Ejes y subejes_","index":5,"n_rows":139,"n_cols":7,"rows_kept":139,"cut":false,"hidden":true,"merged":[]}
["Eje","SUB Eje","SUB Sub Eje","DENOMINACIÓN"]
[1,null,null,"Igualdad y Derechos"]
[null,11,null,"Derecho a la educación"]
[null,null,111,"Ampliar y fortalecer la educación inicial",null,null,1]
[null,null,112,"Apoyar a la Secretaría de Educación Pública Federal en la mejora integral de la educación básica en la Ciudad",null,null,2]
[null,null,113,"Fortalecer y ampliar la cobertura de la educación media superior en las demarcaciones periféricas",null,null,3]
[null,null,114,"Fortalecer y ampliar la cobertura de la educación superior pública",null,null,4]
[null,null,115,"PILARES: Puntos de Innovación, Libertades, Artes, Educación y Saberes",null,null,5]
[null,12,null,"Derecho a la salud",null,null,6]
[null,null,121,"Salud Universal",null,null,7]
[null,null,122,"Integración hacia un sistema único de atención a la salud",null,null,8]
[null,null,123,"Ampliación de servicios y atención de emergencias",null,null,9]
[null,null,124,"Participación para una vida saludable",null,null,10]
[null,null,125,"Profesionalización del servicio médico",null,null,11]
[null,13,null,"Derecho a la cultura física y la práctica del deporte",null,null,12]
[null,null,131," Promoción del deporte comunitario ",null,null,13]
[null,null,132,"Fortalecimiento de infraestructura deportiva",null,null,14]
[null,null,133,"Condiciones óptimas para deportistas de alto rendimiento",null,null,15]
[null,14,null,"Derecho a la vivienda",null,null,0]
[null,null,141,"Reconstrucción y rehabilitación de viviendas dañadas por el sismo de 2017"]
{"$rows_left_out":119}